Target
Phosphatidylinositol 4,5-bisphosphate 3-kinase catalytic subunit gamma isoform
Ligand
BDBM288344
Substrate
Meas. Tech.
KINOMEscan Enzyme Binding Assays
Kd
2291±n/a nM
Citation
 Mevellec, LAMeerpoel, LCoupa, SPoncelet, VSPilatte, INPasquier, ETBerthelot, DJQuerolle, OAMeyer, CAngibaud, PRDemestre, CGMercey, GJ Imidazopyridazine derivatives as PI3KB inhibitors US Patent  US10087187 Publication Date 10/2/2018 
Target
Name:
Phosphatidylinositol 4,5-bisphosphate 3-kinase catalytic subunit gamma isoform
Synonyms:
PI3-kinase p110 subunit gamma PI3Kgamma PK3CG_HUMAN Phosphatidylinositol 4,5-bisphosphate 3-kinase (PI3K) Phosphatidylinositol 4,5-bisphosphate 3-kinase catalytic subunit gamma (PI3Kgamma) Phosphatidylinositol 4,5-bisphosphate 3-kinase catalytic subunit gamma isoform (PI3K) Phosphatidylinositol-4,5-bisphosphate 3-kinase catalytic subunit gamma isoform Phosphoinositide 3-kinases gamma (PI3K gamma) p120-PI3K
Type:
Enzyme Subunit
Mol. Mass.:
126470.30
Organism:
Homo sapiens (Human)
Description:
P48736
Residue:
1102
  
Inhibitor
Name:
BDBM288344
Synonyms:
US10087187, Compound 34 | US10087187, Compound 35
Type:
Small organic molecule
Emp. Form.:
C22H22F3N7O
Mol. Mass.:
457.4516
SMILES:
Cc1nc2c(cc(nn2c1Nc1cccc(c1C)C(F)(F)F)N1CCOCC1)-c1ncc[nH]1
: