Target
Dual specificity tyrosine-phosphorylation-regulated kinase 1A
Ligand
BDBM50395381
Substrate
Meas. Tech.
Radiometric Protein Kinase Assay
pH
7.5±n/a
IC50
21200±n/a nM
Comments
extracted
Citation
 Frederick, RMasereel, BReniers, JWouters, JBruyere, CKiss, RMeinguet, CAMathieu, VE Beta carboline derivatives useful in the treatment of proliferative disorders US Patent  US9168247 Publication Date 10/27/2015 
Target
Name:
Dual specificity tyrosine-phosphorylation-regulated kinase 1A
Synonyms:
DYR1A_HUMAN DYRK1A Dual specificity YAK1-related kinase 1A (Dyrk1A) Dual-specificity tyrosine-phosphorylation regulated kinase 1A HP86 MNBH
Type:
Enzyme
Mol. Mass.:
85616.61
Organism:
Homo sapiens (Human)
Description:
Q13627
Residue:
763
  
Inhibitor
Name:
BDBM50395381
Synonyms:
CHEMBL2164716 | US9168247, JR95
Type:
Small organic molecule
Emp. Form.:
C33H29N2O
Mol. Mass.:
469.5956
SMILES:
Cc1[n+](Cc2ccccc2)ccc2c1n(Cc1ccccc1)c1cc(OCc3ccccc3)ccc21
: