Target
Dihydrolipoyllysine-residue acetyltransferase component of pyruvate dehydrogenase complex
Ligand
BDBM188213
Substrate
Meas. Tech.
Inhibition Assay
pH
7±n/a
IC50
1130±n/a nM
Comments
extracted
Citation
 Wong, CWu, Y Compounds and methods for treating tuberculosis infection US Patent  US9073941 Publication Date 7/7/2015 
Target
Name:
Dihydrolipoyllysine-residue acetyltransferase component of pyruvate dehydrogenase complex
Synonyms:
ODP2_MYCTU dlaT | sucB
Type:
Enzyme
Mol. Mass.:
57069.35
Organism:
Mycobacterium tuberculosis
Description:
P9WIS7
Residue:
553
  
Inhibitor
Name:
BDBM188213
Synonyms:
US9073941, 102
Type:
Small organic molecule
Emp. Form.:
C18H16O2
Mol. Mass.:
264.3184
SMILES:
CCOc1ccccc1\C=C1/Cc2ccccc2C1=O
: