Target
Dihydrolipoyllysine-residue acetyltransferase component of pyruvate dehydrogenase complex
Ligand
BDBM188221
Substrate
Meas. Tech.
Inhibition Assay
pH
7±n/a
IC50
140±n/a nM
Comments
extracted
Citation
 Wong, CWu, Y Compounds and methods for treating tuberculosis infection US Patent  US9073941 Publication Date 7/7/2015 
Target
Name:
Dihydrolipoyllysine-residue acetyltransferase component of pyruvate dehydrogenase complex
Synonyms:
ODP2_MYCTU dlaT | sucB
Type:
Enzyme
Mol. Mass.:
57069.35
Organism:
Mycobacterium tuberculosis
Description:
P9WIS7
Residue:
553
  
Inhibitor
Name:
BDBM188221
Synonyms:
US9073941, 401
Type:
Small organic molecule
Emp. Form.:
C16H11N
Mol. Mass.:
217.2652
SMILES:
c1c2ccccc2n2ccc3ccccc3c12
: