Target
Dihydrolipoyl dehydrogenase
Ligand
BDBM188229
Substrate
Meas. Tech.
Inhibition Assay
pH
7±n/a
IC50
2550±790 nM
Comments
extracted
Citation
 Wong, CWu, Y Compounds and methods for treating tuberculosis infection US Patent  US9073941 Publication Date 7/7/2015 
Target
Name:
Dihydrolipoyl dehydrogenase
Synonyms:
DLDH_MYCTU lpd | lpdC
Type:
Enzyme
Mol. Mass.:
49231.98
Organism:
Mycobacterium tuberculosis
Description:
P9WHH9
Residue:
464
  
Inhibitor
Name:
BDBM188229
Synonyms:
US9073941, 511
Type:
Small organic molecule
Emp. Form.:
C20H28N4O3S
Mol. Mass.:
404.526
SMILES:
CCc1cccc(NC(=O)C2CCN(CC2)S(=O)(=O)c2cn(cn2)C(C)C)c1
: