Target
Dihydrolipoyl dehydrogenase
Ligand
BDBM188250
Substrate
Meas. Tech.
Inhibition Assay
pH
7±n/a
IC50
2850±510 nM
Comments
extracted
Citation
 Wong, CWu, Y Compounds and methods for treating tuberculosis infection US Patent  US9073941 Publication Date 7/7/2015 
Target
Name:
Dihydrolipoyl dehydrogenase
Synonyms:
DLDH_MYCTU lpd | lpdC
Type:
Enzyme
Mol. Mass.:
49231.98
Organism:
Mycobacterium tuberculosis
Description:
P9WHH9
Residue:
464
  
Inhibitor
Name:
BDBM188250
Synonyms:
US9073941, 532
Type:
Small organic molecule
Emp. Form.:
C19H25FN4O3S
Mol. Mass.:
408.49
SMILES:
CC(C)n1cnc(c1)S(=O)(=O)N1CCC(CC1)C(=O)Nc1ccc(C)c(F)c1
: