Target
Dihydrolipoyl dehydrogenase
Ligand
BDBM50438910
Substrate
Meas. Tech.
Inhibition Assay
pH
7±n/a
IC50
<40±n/a nM
Comments
extracted
Citation
 Wong, CWu, Y Compounds and methods for treating tuberculosis infection US Patent  US9073941 Publication Date 7/7/2015 
Target
Name:
Dihydrolipoyl dehydrogenase
Synonyms:
DLDH_MYCTU lpd | lpdC
Type:
Enzyme
Mol. Mass.:
49231.98
Organism:
Mycobacterium tuberculosis
Description:
P9WHH9
Residue:
464
  
Inhibitor
Name:
BDBM50438910
Synonyms:
CHEMBL1450796 | US9073941, 618
Type:
Small organic molecule
Emp. Form.:
C14H13N5O2
Mol. Mass.:
283.2853
SMILES:
Cc1ccc(cc1)-c1nn(C)c2nc(=O)n(C)c(=O)c2n1
: