Target
Dihydrolipoyllysine-residue acetyltransferase component of pyruvate dehydrogenase complex
Ligand
BDBM188287
Substrate
Meas. Tech.
Inhibition Assay
pH
7±n/a
IC50
<40±n/a nM
Comments
extracted
Citation
 Wong, CWu, Y Compounds and methods for treating tuberculosis infection US Patent  US9073941 Publication Date 7/7/2015 
Target
Name:
Dihydrolipoyllysine-residue acetyltransferase component of pyruvate dehydrogenase complex
Synonyms:
ODP2_MYCTU dlaT | sucB
Type:
Enzyme
Mol. Mass.:
57069.35
Organism:
Mycobacterium tuberculosis
Description:
P9WIS7
Residue:
553
  
Inhibitor
Name:
BDBM188287
Synonyms:
US9073941, 608
Type:
Small organic molecule
Emp. Form.:
C13H12N6O2
Mol. Mass.:
284.2734
SMILES:
CCn1nc(nc2c1nc(=O)n(C)c2=O)-c1cccnc1
: