Target
Dihydrolipoyllysine-residue acetyltransferase component of pyruvate dehydrogenase complex
Ligand
BDBM34697
Substrate
Meas. Tech.
Inhibition Assay
pH
7±n/a
IC50
>5000±n/a nM
Comments
extracted
Citation
 Wong, CWu, Y Compounds and methods for treating tuberculosis infection US Patent  US9073941 Publication Date 7/7/2015 
Target
Name:
Dihydrolipoyllysine-residue acetyltransferase component of pyruvate dehydrogenase complex
Synonyms:
ODP2_MYCTU dlaT | sucB
Type:
Enzyme
Mol. Mass.:
57069.35
Organism:
Mycobacterium tuberculosis
Description:
P9WIS7
Residue:
553
  
Inhibitor
Name:
BDBM34697
Synonyms:
MLS000569396 N-(1-butan-2-yl-3-cyano-pyrrolo[3,2-b]quinoxalin-2-yl)benzamide N-(3-cyano-1-sec-butyl-pyrrolo[3,2-b]quinoxalin-2-yl)benzamide US9073941, 1004 | cid_4101144
Type:
Small organic molecule
Emp. Form.:
C22H19N5O
Mol. Mass.:
369.4192
SMILES:
CCC(C)n1c(NC(=O)c2ccccc2)c(C#N)c2nc3ccccc3nc12
: