Target
5-hydroxytryptamine receptor 1A
Ligand
BDBM186963
Substrate
Meas. Tech.
Radioligand Binding Assay
pH
7.4±n/a
Ki
>10000±n/a nM
Comments
extracted
Citation
 Besnard, JHopkins, ALGilbert, IRuda, GFAbecassis, K Morpholino compounds, uses and methods US Patent  US9079895 Publication Date 7/14/2015 
Target
Name:
5-hydroxytryptamine receptor 1A
Synonyms:
5-HT1A 5-hydroxytryptamine receptor 1A (5HT1A) Gpcr18 Serotonin 1a (5-HT1a) receptor
Type:
Enzyme
Mol. Mass.:
46192.09
Organism:
Mus musculus (Mouse)
Description:
Q64264
Residue:
421
  
Inhibitor
Name:
BDBM186963
Synonyms:
US9079895, 65
Type:
Small organic molecule
Emp. Form.:
C22H25ClN2O3
Mol. Mass.:
400.899
SMILES:
CC1Cc2ccccc2N1C(=O)CN1CCO[C@@H](COc2cccc(Cl)c2)C1
: