Target
5-hydroxytryptamine receptor 2A
Ligand
BDBM186937
Substrate
Meas. Tech.
Radioligand Binding Assay
pH
7.4±n/a
Ki
1399±n/a nM
Comments
extracted
Citation
 Besnard, JHopkins, ALGilbert, IRuda, GFAbecassis, K Morpholino compounds, uses and methods US Patent  US9079895 Publication Date 7/14/2015 
Target
Name:
5-hydroxytryptamine receptor 2A
Synonyms:
5-HT-2 5-hydroxytryptamine receptor 2A 5HT2A_MOUSE Htr2 Serotonin 2a (5-HT2a) receptor
Type:
Enzyme
Mol. Mass.:
52843.00
Organism:
Mus musculus (Mouse)
Description:
P35363
Residue:
471
  
Inhibitor
Name:
BDBM186937
Synonyms:
US9079895, 25s
Type:
Small organic molecule
Emp. Form.:
C22H28N2O3
Mol. Mass.:
368.4693
SMILES:
COc1cccc(OC[C@@H]2CN(CCN3CCc4ccccc34)CCO2)c1
: