Target
5-hydroxytryptamine receptor 2C
Ligand
BDBM186968
Substrate
Meas. Tech.
Radioligand Binding Assay
pH
7.4±n/a
Ki
6374±n/a nM
Comments
extracted
Citation
 Besnard, JHopkins, ALGilbert, IRuda, GFAbecassis, K Morpholino compounds, uses and methods US Patent  US9079895 Publication Date 7/14/2015 
Target
Name:
5-hydroxytryptamine receptor 2C
Synonyms:
5-HT2C 5-hydroxytryptamine receptor 2C (5HT2C) 5ht1c Htr1c Serotonin 2c (5-HT2c) receptor
Type:
Enzyme
Mol. Mass.:
51948.16
Organism:
Mus musculus (Mouse)
Description:
P34968
Residue:
459
  
Inhibitor
Name:
BDBM186968
Synonyms:
US9079895, 70
Type:
Small organic molecule
Emp. Form.:
C22H27N3O3
Mol. Mass.:
381.4681
SMILES:
CC1Cc2ccccc2N1C(=O)CN1CCO[C@@H](COc2cc(C)ccn2)C1
: