Target
Alpha-1A adrenergic receptor
Ligand
BDBM186927
Substrate
Meas. Tech.
Radioligand Binding Assay
pH
7.4±n/a
Ki
2720±n/a nM
Comments
extracted
Citation
 Besnard, JHopkins, ALGilbert, IRuda, GFAbecassis, K Morpholino compounds, uses and methods US Patent  US9079895 Publication Date 7/14/2015 
Target
Name:
Alpha-1A adrenergic receptor
Synonyms:
ADA1A_MOUSE Adra1c | Alpha-1 adrenergic receptor
Type:
Enzyme
Mol. Mass.:
51769.32
Organism:
Mus musculus (Mouse)
Description:
P97718
Residue:
466
  
Inhibitor
Name:
BDBM186927
Synonyms:
US9079895, 19s
Type:
Small organic molecule
Emp. Form.:
C21H26N2O2
Mol. Mass.:
338.4433
SMILES:
C(CN1CCO[C@H](COc2ccccc2)C1)N1CCc2ccccc12
: