Target
D(1A) dopamine receptor
Ligand
BDBM186924
Substrate
Meas. Tech.
Radioligand Binding Assay
pH
7.4±n/a
Ki
>10000±n/a nM
Comments
extracted
Citation
 Besnard, JHopkins, ALGilbert, IRuda, GFAbecassis, K Morpholino compounds, uses and methods US Patent  US9079895 Publication Date 7/14/2015 
Target
Name:
D(1A) dopamine receptor
Synonyms:
D(1A) dopamine receptor DRD1_MOUSE Dopamine receptor Drd1a | Gpcr15
Type:
Enzyme
Mol. Mass.:
49613.93
Organism:
Mus musculus (Mouse)
Description:
Q61616
Residue:
446
  
Inhibitor
Name:
BDBM186924
Synonyms:
US9079895, 16r
Type:
Small organic molecule
Emp. Form.:
C21H25N3O3
Mol. Mass.:
367.4415
SMILES:
Cc1ccnc(OC[C@H]2CN(CC(=O)N3CCc4ccccc34)CCO2)c1
: