Target
D(1A) dopamine receptor
Ligand
BDBM186935
Substrate
Meas. Tech.
Radioligand Binding Assay
pH
7.4±n/a
Ki
2041±n/a nM
Comments
extracted
Citation
 Besnard, JHopkins, ALGilbert, IRuda, GFAbecassis, K Morpholino compounds, uses and methods US Patent  US9079895 Publication Date 7/14/2015 
Target
Name:
D(1A) dopamine receptor
Synonyms:
D(1A) dopamine receptor DRD1_MOUSE Dopamine receptor Drd1a | Gpcr15
Type:
Enzyme
Mol. Mass.:
49613.93
Organism:
Mus musculus (Mouse)
Description:
Q61616
Residue:
446
  
Inhibitor
Name:
BDBM186935
Synonyms:
US9079895, 23s
Type:
Small organic molecule
Emp. Form.:
C21H25ClN2O2
Mol. Mass.:
372.888
SMILES:
Clc1cccc(OC[C@@H]2CN(CCN3CCc4ccccc34)CCO2)c1
: