Target
D(4) dopamine receptor
Ligand
BDBM186938
Substrate
Meas. Tech.
Radioligand Binding Assay
pH
7.4±n/a
Ki
2486±n/a nM
Comments
extracted
Citation
 Besnard, JHopkins, ALGilbert, IRuda, GFAbecassis, K Morpholino compounds, uses and methods US Patent  US9079895 Publication Date 7/14/2015 
Target
Name:
D(4) dopamine receptor
Synonyms:
DRD4_MOUSE Drd4
Type:
Enzyme
Mol. Mass.:
41498.73
Organism:
Mus musculus (Mouse)
Description:
P51436
Residue:
387
  
Inhibitor
Name:
BDBM186938
Synonyms:
US9079895, 25r
Type:
Small organic molecule
Emp. Form.:
C22H26N2O4
Mol. Mass.:
382.4528
SMILES:
COc1cccc(OC[C@H]2CN(CC(=O)N3CCc4ccccc34)CCO2)c1
: