Target
D(4) dopamine receptor
Ligand
BDBM186962
Substrate
Meas. Tech.
Radioligand Binding Assay
pH
7.4±n/a
Ki
2394±n/a nM
Comments
extracted
Citation
 Besnard, JHopkins, ALGilbert, IRuda, GFAbecassis, K Morpholino compounds, uses and methods US Patent  US9079895 Publication Date 7/14/2015 
Target
Name:
D(4) dopamine receptor
Synonyms:
DRD4_MOUSE Drd4
Type:
Enzyme
Mol. Mass.:
41498.73
Organism:
Mus musculus (Mouse)
Description:
P51436
Residue:
387
  
Inhibitor
Name:
BDBM186962
Synonyms:
US9079895, 64
Type:
Small organic molecule
Emp. Form.:
C22H25ClN2O3
Mol. Mass.:
400.899
SMILES:
CC1Cc2ccccc2N1C(=O)CN1CCO[C@H](COc2cccc(Cl)c2)C1
: