Target
D(1B) dopamine receptor
Ligand
BDBM186937
Substrate
Meas. Tech.
Radioligand Binding Assay
pH
7.4±n/a
Ki
8526±n/a nM
Comments
extracted
Citation
 Besnard, JHopkins, ALGilbert, IRuda, GFAbecassis, K Morpholino compounds, uses and methods US Patent  US9079895 Publication Date 7/14/2015 
Target
Name:
D(1B) dopamine receptor
Synonyms:
DRD5_MOUSE Drd5
Type:
Enzyme
Mol. Mass.:
53074.14
Organism:
Mus musculus (Mouse)
Description:
Q8BLD9
Residue:
478
  
Inhibitor
Name:
BDBM186937
Synonyms:
US9079895, 25s
Type:
Small organic molecule
Emp. Form.:
C22H28N2O3
Mol. Mass.:
368.4693
SMILES:
COc1cccc(OC[C@@H]2CN(CCN3CCc4ccccc34)CCO2)c1
: