Target
Nicotinamide phosphoribosyltransferase
Ligand
BDBM186975
Substrate
Meas. Tech.
Biochemical Inhibition Assay
pH
7.5±n/a
Temperature
298.15±n/a K
IC50
56.5±n/a nM
Comments
extracted
Citation
 Bair, KWBaumeister, TBuckmelter, AJClodfelter, KHHan, BLin, JReynolds, DJSmith, CCWang, ZZheng, X Compounds and compositions for the inhibition of NAMPT US Patent  US9169209 Publication Date 10/27/2015 
Target
Name:
Nicotinamide phosphoribosyltransferase
Synonyms:
NAMPT NAmPRTase Nicotinamide phosphoribosyltransferase (NAMPT) PBEF1 | Pre-B-cell colony-enhancing factor 1
Type:
Enzyme
Mol. Mass.:
55524.98
Organism:
Homo sapiens (Human)
Description:
P43490
Residue:
491
  
Inhibitor
Name:
BDBM186975
Synonyms:
US9169209, Table 3, Compound 6
Type:
Small organic molecule
Emp. Form.:
C21H15F3N2O3S
Mol. Mass.:
432.416
SMILES:
FC(F)(F)c1ccc(cc1)S(=O)(=O)c1ccc(NC(=O)\C=C\c2cccnc2)cc1
: