Target
Nicotinamide phosphoribosyltransferase
Ligand
BDBM187009
Substrate
Meas. Tech.
Biochemical Inhibition Assay
pH
7.5±n/a
Temperature
298.15±n/a K
IC50
8.9±n/a nM
Comments
extracted
Citation
 Bair, KWBaumeister, TBuckmelter, AJClodfelter, KHHan, BLin, JReynolds, DJSmith, CCWang, ZZheng, X Compounds and compositions for the inhibition of NAMPT US Patent  US9169209 Publication Date 10/27/2015 
Target
Name:
Nicotinamide phosphoribosyltransferase
Synonyms:
NAMPT NAmPRTase Nicotinamide phosphoribosyltransferase (NAMPT) PBEF1 | Pre-B-cell colony-enhancing factor 1
Type:
Enzyme
Mol. Mass.:
55524.98
Organism:
Homo sapiens (Human)
Description:
P43490
Residue:
491
  
Inhibitor
Name:
BDBM187009
Synonyms:
US9169209, Table 3, Compound 41
Type:
Small organic molecule
Emp. Form.:
C22H18N4O3S
Mol. Mass.:
418.468
SMILES:
Cn1ncc2cccc(c12)S(=O)(=O)c1ccc(NC(=O)\C=C\c2cccnc2)cc1
: