Target
RAC-alpha serine/threonine-protein kinase
Ligand
BDBM187354
Substrate
Meas. Tech.
Time-Resolved Fluorescence Resonance energy transfer (TR-FRET) Immunoassay
IC50
0.9±n/a nM
Citation
 Notte, G Apoptosis signal-regulating kinase inhibitors US Patent  US9169243 Publication Date 10/27/2015 
Target
Name:
RAC-alpha serine/threonine-protein kinase
Synonyms:
AKT phosphorylation (p-AKT) AKT1/PPP1CA C-AKT PKB alpha Protein kinase B Protein kinase B (Akt 1) Protein kinase B alpha Proto-oncogene Akt (Akt1) Proto-oncogene c-Akt (AKT1) RAC-PK-alpha RAC-alpha serine/threonine-protein kinase (AKT1) | RAC-alpha serine/threonine-protein kinase (pAKT)
Type:
Enzyme
Mol. Mass.:
55681.25
Organism:
Homo sapiens (Human)
Description:
P31749
Residue:
480
  
Inhibitor
Name:
BDBM187354
Synonyms:
US9169243, 2 | US9908875, 2
Type:
Small organic molecule
Emp. Form.:
C24H22N10OS
Mol. Mass.:
498.563
SMILES:
O=C(Nc1csc(n1)-c1nncn1C1CC1)c1cc(c(cn1)N1CC(C1)C#N)-n1cnc(c1)C1CC1
: