Target
Kappa-type opioid receptor
Ligand
BDBM156523
Substrate
Meas. Tech.
OPRK1 antagonist assay
Temperature
298.15±n/a K
IC50
0.50±n/a nM
Comments
extracted
Citation
 Roberts, EGuerrero, MAUrbano, MRosen, H Kappa opioid ligands US Patent  US9682966 Publication Date 6/20/2017 
Target
Name:
Kappa-type opioid receptor
Synonyms:
K-OR-1 Kappa-opioid receptor (KOR) Kappa-type opioid receptor (KOR) OPIATE Kappa OPRK1 kappa opioid receptor (KOR)
Type:
G Protein-Coupled Receptor (GPCR)
Mol. Mass.:
42648.76
Organism:
Homo sapiens (Human)
Description:
P41145
Residue:
380
  
Inhibitor
Name:
BDBM156523
Synonyms:
US10118915, Compound 309 | US9682966, 309
Type:
Small organic molecule
Emp. Form.:
C24H31N5O2
Mol. Mass.:
421.5352
SMILES:
COC1CN(CCC1NC1CCCC1)c1nc2ccc(C)cc2cc1-c1nc(C)no1
: