Target
Tyrosine-protein kinase BTK
Ligand
BDBM288543
Substrate
Meas. Tech.
Btk Enzyme Activity Assay
IC50
0.380±n/a nM
Citation
 Liu, JKozlowski, JAAlhassan, ABoga, SBGao, XGuiadeen, DGWang, JYu, WCai, JLiu, SWang, DWu, HYang, C Benzamide imidazopyrazine Btk inhibitors US Patent  US10087188 Publication Date 10/2/2018 
Target
Name:
Tyrosine-protein kinase BTK
Synonyms:
AGMX1 Agammaglobulinaemia tyrosine kinase B cell progenitor kinase BPK BTK_HUMAN Tyrosine Kinase BTK Tyrosine-protein kinase BTK (BTK)
Type:
Enzyme
Mol. Mass.:
76289.95
Organism:
Homo sapiens (Human)
Description:
Q06187
Residue:
659
  
Inhibitor
Name:
BDBM288543
Synonyms:
4-[8-amino-1-(2- chloro-4-{[4- (trifluoromethyl) pyridin-2- yl]carbamoyl}phenyl) imidazo[1,5-a]pyrazin- 3- yl]bicyclo[2.2.2] octane-1-carboxylic acid | US10087188, Example 151
Type:
Small organic molecule
Emp. Form.:
C28H24ClF3N6O3
Mol. Mass.:
584.977
SMILES:
Nc1nccn2c(nc(-c3ccc(cc3Cl)C(=O)Nc3cc(ccn3)C(F)(F)F)c12)C12CCC(CC1)(CC2)C(O)=O
: