Target
Interleukin-1 receptor-associated kinase 4
Ligand
BDBM188057
Substrate
Meas. Tech.
Inhibition Assay
pH
7.2±n/a
IC50
2.7±n/a nM
Citation
 Santella, JBKumar, SRDuncia, JVGardner, DSPaidi, VRNair, SKHynes, JWu, HMurugesan, NSarkunam, KArunachalam, P Heteroaryl substituted nicotinamide compounds US Patent  US9169252 Publication Date 10/27/2015 
Target
Name:
Interleukin-1 receptor-associated kinase 4
Synonyms:
IRAK-4 IRAK4_HUMAN Interleukin-1 receptor-associated kinase 4 (IRAK4) | Renal carcinoma antigen NY-REN-64
Type:
Protein
Mol. Mass.:
51519.08
Organism:
Homo sapiens (Human)
Description:
Q9NWZ3
Residue:
460
  
Inhibitor
Name:
BDBM188057
Synonyms:
US9169252, 591
Type:
Small organic molecule
Emp. Form.:
C21H24F2N8O2
Mol. Mass.:
458.4645
SMILES:
C[C@@H](F)CNc1cc(ncc1C(=O)NC[C@@H](F)C(C)(C)O)-n1ncc2cc(C#N)c(N)nc12
: