Target
Interleukin-1 receptor-associated kinase 4
Ligand
BDBM188076
Substrate
Meas. Tech.
Inhibition Assay
pH
7.2±n/a
IC50
4±n/a nM
Citation
 Santella, JBKumar, SRDuncia, JVGardner, DSPaidi, VRNair, SKHynes, JWu, HMurugesan, NSarkunam, KArunachalam, P Heteroaryl substituted nicotinamide compounds US Patent  US9169252 Publication Date 10/27/2015 
Target
Name:
Interleukin-1 receptor-associated kinase 4
Synonyms:
IRAK-4 IRAK4_HUMAN Interleukin-1 receptor-associated kinase 4 (IRAK4) | Renal carcinoma antigen NY-REN-64
Type:
Protein
Mol. Mass.:
51519.08
Organism:
Homo sapiens (Human)
Description:
Q9NWZ3
Residue:
460
  
Inhibitor
Name:
BDBM188076
Synonyms:
US9169252, 607
Type:
Small organic molecule
Emp. Form.:
C25H30FN7O3
Mol. Mass.:
495.5492
SMILES:
CC(C)(O)[C@H](F)CNC(=O)c1cnc(cc1N[C@H]1CC[C@@](C)(O)CC1)-n1ncc2cc(cnc12)C#N
: