Target
Tyrosine-protein kinase SYK [360-635]
Ligand
BDBM188174
Substrate
Meas. Tech.
Inhibition Assay
IC50
1.55±n/a nM
Citation
 Hermann, JCKuglstatter, ALucas, MCPadilla, FWanner, JZhang, X Imidazopyridazine compounds US Patent  US9169259 Publication Date 10/27/2015 
Target
Name:
Tyrosine-protein kinase SYK [360-635]
Synonyms:
KSYK_HUMAN SYK RPA purified, truncated construct of Spleen Tyrosine Kinase (aa 360-635) recombinant human SYK(aa 360-635)
Type:
Mol. Mass.:
31987.15
Organism:
Homo sapiens (Human)
Description:
Human MetAP2 protein from a culture superatant of insect cells (sf9) infected with MetAP2 recombinant baculovirus
Residue:
276
  
Inhibitor
Name:
BDBM188174
Synonyms:
US9169259, I-57
Type:
Small organic molecule
Emp. Form.:
C28H24N6O6
Mol. Mass.:
540.5268
SMILES:
COc1ccc(Nc2cc(nn3ccnc23)-c2cccc(c2)C(=O)Nc2ccc(C(O)=O)c(OC)c2)nc1OC
: