Target
Solute carrier family 2, facilitated glucose transporter member 1
Ligand
BDBM188523
Substrate
Meas. Tech.
[3H]-2-Deoxy-D-glucose ([3H]-2-DG) Uptake Assay
IC50
2.71e+4±n/a nM
Citation
 Ung, PMSong, WCheng, LZhao, XHu, HChen, LSchlessinger, A Inhibitor Discovery for the Human GLUT1 from Homology Modeling and Virtual Screening. ACS Chem Biol 11:1908-16 (2016)  
Target
Name:
Solute carrier family 2, facilitated glucose transporter member 1
Synonyms:
GLUT-1 GTR1_HUMAN Glucose transporter HepG2 glucose transporter | SLC2A1
Type:
Protein
Mol. Mass.:
54091.71
Organism:
Homo sapiens (Human)
Description:
Residue:
492
  
Inhibitor
Name:
BDBM188523
Synonyms:
PUG-3
Type:
Small organic molecule
Emp. Form.:
C10H11N7O
Mol. Mass.:
245.2406
SMILES:
NNc1nc(NCc2ccco2)c2nc[nH]c2n1
: