Target
G-protein coupled estrogen receptor 1
Ligand
BDBM288615
Substrate
Meas. Tech.
Biological Assay
IC50
0.860±n/a nM
Citation
 Yu, SYang, FChen, LYan, JZhang, XXie, ZChen, LHe, M Piperidine derivative and preparation method and pharmaceutical use thereof US Patent  US10087191 Publication Date 10/2/2018 
Target
Name:
G-protein coupled estrogen receptor 1
Synonyms:
CEPR DRY12 G-protein-coupled receptor (GPR30 ) GPER1 GPR30
Type:
PROTEIN
Mol. Mass.:
42259.21
Organism:
Homo sapiens (Human)
Description:
ChEMBL_982507
Residue:
375
  
Inhibitor
Name:
BDBM288615
Synonyms:
(E)-3-(4-((1S,3R/1R,3S)-6-(1-ethyl-1H-pyrazol -4-yl)-2-(2-fluoro-2-methylpropyl)-3-methyl-1,2,3,4-tetrahydroisoquinolin-1-yl)-3,5-difluorophenyl)acrylic acid | US10087191, Example 20
Type:
Small organic molecule
Emp. Form.:
C28H30F3N3O2
Mol. Mass.:
497.5519
SMILES:
CCn1cc(cn1)-c1ccc2C(N(CC(C)(C)F)C(C)Cc2c1)c1c(F)cc(\C=C\C(O)=O)cc1F
: