Target
G-protein coupled estrogen receptor 1
Ligand
BDBM288651
Substrate
Meas. Tech.
Biological Assay
IC50
3.25±n/a nM
Citation
 Yu, SYang, FChen, LYan, JZhang, XXie, ZChen, LHe, M Piperidine derivative and preparation method and pharmaceutical use thereof US Patent  US10087191 Publication Date 10/2/2018 
Target
Name:
G-protein coupled estrogen receptor 1
Synonyms:
CEPR DRY12 G-protein-coupled receptor (GPR30 ) GPER1 GPR30
Type:
PROTEIN
Mol. Mass.:
42259.21
Organism:
Homo sapiens (Human)
Description:
ChEMBL_982507
Residue:
375
  
Inhibitor
Name:
BDBM288651
Synonyms:
(E)-3-(3,5-difluoro-4-((1S,3R/1R,3S)-2-(2-fluoro-2-methylpropyl)-3-methyl-6-(2-methylbenzo[d]thiazol-6-yl)-1,2,3,4-tetrahydroisoquinolin-1-yl)phenyl)acrylic acid | US10087191, Example 66
Type:
Small organic molecule
Emp. Form.:
C31H29F3N2O2S
Mol. Mass.:
550.634
SMILES:
CC1Cc2cc(ccc2C(N1CC(C)(C)F)c1c(F)cc(\C=C\C(O)=O)cc1F)-c1ccc2nc(C)sc2c1
: