Target
G-protein coupled estrogen receptor 1
Ligand
BDBM288664
Substrate
Meas. Tech.
Biological Assay
IC50
4.06±n/a nM
Citation
 Yu, SYang, FChen, LYan, JZhang, XXie, ZChen, LHe, M Piperidine derivative and preparation method and pharmaceutical use thereof US Patent  US10087191 Publication Date 10/2/2018 
Target
Name:
G-protein coupled estrogen receptor 1
Synonyms:
CEPR DRY12 G-protein-coupled receptor (GPR30 ) GPER1 GPR30
Type:
PROTEIN
Mol. Mass.:
42259.21
Organism:
Homo sapiens (Human)
Description:
ChEMBL_982507
Residue:
375
  
Inhibitor
Name:
BDBM288664
Synonyms:
(E)-3-(3,5-difluoro-4-((5S,7R/5R,7S)-6-(2-fluoro-2-methylpropyl)-7-methyl-5,6,7,8-tetrahydrooxazolo[5,4-g]isoquinolin-5-yl)phenyl)acrylic acid | US10087191, Example 81
Type:
Small organic molecule
Emp. Form.:
C24H23F3N2O3
Mol. Mass.:
444.4462
SMILES:
CC1Cc2cc3ocnc3cc2C(N1CC(C)(C)F)c1c(F)cc(\C=C\C(O)=O)cc1F
: