Target
G-protein coupled estrogen receptor 1
Ligand
BDBM288670
Substrate
Meas. Tech.
Biological Assay
IC50
15.0±n/a nM
Citation
 Yu, SYang, FChen, LYan, JZhang, XXie, ZChen, LHe, M Piperidine derivative and preparation method and pharmaceutical use thereof US Patent  US10087191 Publication Date 10/2/2018 
Target
Name:
G-protein coupled estrogen receptor 1
Synonyms:
CEPR DRY12 G-protein-coupled receptor (GPR30 ) GPER1 GPR30
Type:
PROTEIN
Mol. Mass.:
42259.21
Organism:
Homo sapiens (Human)
Description:
ChEMBL_982507
Residue:
375
  
Inhibitor
Name:
BDBM288670
Synonyms:
(E)-3-(4-((1R,3R/1S,3S)-6-bromo-2-(2-fluoro-2-methylpropyl)-3-methyl-1,2,3,4-tetrahydrobenzofuro[2,3-c]pyridin-1-yl)-3,5-difluorophenyl)acrylic acid | US10087191, Example 87
Type:
Small organic molecule
Emp. Form.:
C25H23BrF3NO3
Mol. Mass.:
522.354
SMILES:
CC1Cc2c(oc3ccc(Br)cc23)C(N1CC(C)(C)F)c1c(F)cc(\C=C\C(O)=O)cc1F
: