Target
Methionine aminopeptidase 2
Ligand
BDBM188545
Substrate
Meas. Tech.
Enzymatic Screening Assay
IC50
2.13±n/a nM
Citation
 Benazet, ADuclos, OGuillo, NLassalle, GMacary, KVin, V Pyrazoloquinolinone derivatives, preparation thereof and therapeutic use thereof US Patent  US9169246 Publication Date 10/27/2015 
Target
Name:
Methionine aminopeptidase 2
Synonyms:
Initiation factor 2-associated 67 kDa glycoprotein MAP2_HUMAN MNPEP Methionine aminopeptidase 2 (MetAP2) P67EIF2 p67
Type:
Enzyme
Mol. Mass.:
52884.45
Organism:
Homo sapiens (Human)
Description:
P50579
Residue:
478
  
Inhibitor
Name:
BDBM188545
Synonyms:
US9169246, 30
Type:
Small organic molecule
Emp. Form.:
C22H20F3N5O
Mol. Mass.:
427.4223
SMILES:
FC(F)(F)Cn1c2cc(ccc2c2[nH]ncc2c1=O)-c1ccc(cc1)N1CCNCC1
: