Target
Methionine aminopeptidase 2
Ligand
BDBM188621
Substrate
Meas. Tech.
Enzymatic Screening Assay
IC50
4.29±n/a nM
Citation
 Benazet, ADuclos, OGuillo, NLassalle, GMacary, KVin, V Pyrazoloquinolinone derivatives, preparation thereof and therapeutic use thereof US Patent  US9169246 Publication Date 10/27/2015 
Target
Name:
Methionine aminopeptidase 2
Synonyms:
Initiation factor 2-associated 67 kDa glycoprotein MAP2_HUMAN MNPEP Methionine aminopeptidase 2 (MetAP2) P67EIF2 p67
Type:
Enzyme
Mol. Mass.:
52884.45
Organism:
Homo sapiens (Human)
Description:
P50579
Residue:
478
  
Inhibitor
Name:
BDBM188621
Synonyms:
US9169246, 121
Type:
Small organic molecule
Emp. Form.:
C22H19F3N4O2
Mol. Mass.:
428.4071
SMILES:
CCC(=O)Nc1ccc(C)cc1-c1ccc2c3[nH]ncc3c(=O)n(CC(F)(F)F)c2c1
: