Target
Prostaglandin D2 receptor 2
Ligand
BDBM189198
Substrate
Meas. Tech.
Radioligand Displacement Assay
pH
7±n/a
Temperature
298.15±n/a K
IC50
2.8±n/a nM
Comments
extracted
Citation
 Aissaoui, HBoss, CRichard-Bildstein, SSiegrist, R 1-phenyl-substituted heterocyclyl derivatives and their use as prostaglandin D2 receptor modulators US Patent  US9169270 Publication Date 10/27/2015 
Target
Name:
Prostaglandin D2 receptor 2
Synonyms:
CD_antigen=CD294 Chemoattractant Receptor-homologous molecule expressed on T-helper type 2 cells (CRTH2) Chemoattractant receptor-homologous molecule expressed on Th2 cells (CRTH2) G protein-coupled receptor 44 GPR44 PTGDR2 Prostaglandin D2 receptor 2 | Prostaglandin D2 receptor 2 (PGD2)
Type:
Enzyme
Mol. Mass.:
43295.45
Organism:
Homo sapiens (Human)
Description:
Q9Y5Y4
Residue:
395
  
Inhibitor
Name:
BDBM189198
Synonyms:
US9169270, 70
Type:
Small organic molecule
Emp. Form.:
C20H23ClN2O5S
Mol. Mass.:
438.925
SMILES:
CCC(C)COC(=O)N1CCc2ncsc2[C@H]1c1cc(Cl)ccc1OCC(O)=O
: