Target
Prostaglandin D2 receptor 2
Ligand
BDBM189206
Substrate
Meas. Tech.
Radioligand Displacement Assay
pH
7±n/a
Temperature
298.15±n/a K
IC50
4.4±n/a nM
Comments
extracted
Citation
 Aissaoui, HBoss, CRichard-Bildstein, SSiegrist, R 1-phenyl-substituted heterocyclyl derivatives and their use as prostaglandin D2 receptor modulators US Patent  US9169270 Publication Date 10/27/2015 
Target
Name:
Prostaglandin D2 receptor 2
Synonyms:
CD_antigen=CD294 Chemoattractant Receptor-homologous molecule expressed on T-helper type 2 cells (CRTH2) Chemoattractant receptor-homologous molecule expressed on Th2 cells (CRTH2) G protein-coupled receptor 44 GPR44 PTGDR2 Prostaglandin D2 receptor 2 | Prostaglandin D2 receptor 2 (PGD2)
Type:
Enzyme
Mol. Mass.:
43295.45
Organism:
Homo sapiens (Human)
Description:
Q9Y5Y4
Residue:
395
  
Inhibitor
Name:
BDBM189206
Synonyms:
US9169270, 78
Type:
Small organic molecule
Emp. Form.:
C22H18ClFN2O5S
Mol. Mass.:
476.905
SMILES:
OC(=O)COc1ccc(Cl)cc1C1N(CCc2ncsc12)C(=O)OCc1cccc(F)c1
: