Target
Sonic hedgehog protein
Ligand
BDBM189260
Substrate
Meas. Tech.
Gli-Luc Assay
Temperature
310.15±n/a K
IC50
<10000±n/a nM
Comments
extracted
Citation
 Guicherit, OMRubin, L Mediators of hedgehog signaling pathways, compositions and uses related thereto US Patent  US9173869 Publication Date 11/3/2015 
Target
Name:
Sonic hedgehog protein
Synonyms:
Hhg1 Shh
Type:
Protein
Mol. Mass.:
47784.50
Organism:
Mus musculus (Mouse)
Description:
Q62226
Residue:
437
  
Inhibitor
Name:
BDBM189260
Synonyms:
US9173869, 40
Type:
Small organic molecule
Emp. Form.:
C36H37N3O2
Mol. Mass.:
543.6979
SMILES:
CCCCc1ccc(cc1)C(=O)N(Cc1ccccc1)C(CC)c1nc2ccccc2c(=O)n1-c1ccc(C)cc1
: