Target
Cone cGMP-specific 3',5'-cyclic phosphodiesterase subunit alpha'
Ligand
BDBM86642
Substrate
Meas. Tech.
In Vitro Enzyme Assay
IC50
>100000±n/a nM
Citation
 Hoffman, CSCeyhan, O Inhibitors of phosphodiesterase 11 (PDE11) US Patent  US9173884 Publication Date 11/3/2015 
Target
Name:
Cone cGMP-specific 3',5'-cyclic phosphodiesterase subunit alpha'
Synonyms:
3',5'-cyclic phosphodiesterase PDE6C_HUMAN Phosphodiesterase 6C | Phosphodiesterase 6C (PDE6C)
Type:
Protein
Mol. Mass.:
99132.02
Organism:
Homo sapiens (Human)
Description:
P51160
Residue:
858
  
Inhibitor
Name:
BDBM86642
Synonyms:
BC11-38 | US9173884, BC11-38
Type:
Small organic molecule
Emp. Form.:
C15H16N2OS2
Mol. Mass.:
304.43
SMILES:
CCCSc1nc2CCSc2c(=O)n1-c1ccccc1
: