Target
Dual 3',5'-cyclic-AMP and -GMP phosphodiesterase 11A
Ligand
BDBM86639
Substrate
Meas. Tech.
In Vitro Enzyme Assay
IC50
180±n/a nM
Citation
 Hoffman, CSCeyhan, O Inhibitors of phosphodiesterase 11 (PDE11) US Patent  US9173884 Publication Date 11/3/2015 
Target
Name:
Dual 3',5'-cyclic-AMP and -GMP phosphodiesterase 11A
Synonyms:
Dual 3',5'-cyclic-AMP and -GMP phosphodiesterase 11A PDE11_HUMAN Phosphodiesterase 11A Phosphodiesterase 11A4 | cAMP and cGMP phosphodiesterase 11A
Type:
Enzyme
Mol. Mass.:
104751.53
Organism:
Homo sapiens (Human)
Description:
Q9HCR9
Residue:
933
  
Inhibitor
Name:
BDBM86639
Synonyms:
BC11-15 | US9173884, BC11-15
Type:
Emp. Form.:
C23H24N4OS
Mol. Mass.:
404.528
SMILES:
CCN(CC)C(=O)c1cc(nc2n(nc(C)c12)-c1ccccc1C)-c1cccs1
: