Target
cGMP-inhibited 3',5'-cyclic phosphodiesterase 3A
Ligand
BDBM86639
Substrate
Meas. Tech.
In Vitro Enzyme Assay
IC50
>100000±n/a nM
Citation
 Hoffman, CSCeyhan, O Inhibitors of phosphodiesterase 11 (PDE11) US Patent  US9173884 Publication Date 11/3/2015 
Target
Name:
cGMP-inhibited 3',5'-cyclic phosphodiesterase 3A
Synonyms:
3',5'-cyclic phosphodiesterase Cyclic GMP-inhibited phosphodiesterase A PDE3A_HUMAN Phosphodiesterase 3 (PDE3) Phosphodiesterase 3A Phosphodiesterase 3A (PDE3A1) cGMP-inhibited 3',5'-cyclic phosphodiesterase A | cGMP-inhibited 3,5-cyclic phosphodiesterase A
Type:
Enzyme
Mol. Mass.:
124966.46
Organism:
Homo sapiens (Human)
Description:
Q14432
Residue:
1141
  
Inhibitor
Name:
BDBM86639
Synonyms:
BC11-15 | US9173884, BC11-15
Type:
Emp. Form.:
C23H24N4OS
Mol. Mass.:
404.528
SMILES:
CCN(CC)C(=O)c1cc(nc2n(nc(C)c12)-c1ccccc1C)-c1cccs1
: