Target
Thyrotropin receptor
Ligand
BDBM60850
Substrate
Meas. Tech.
Antagonist Activity Assay
IC50
<100±n/a nM
Citation
 Karstens, WFConti, PGTimmers, CMPlate, RVan Koppen, CJ TSH receptor antagonizing tetrahydroquinoline compounds US Patent  US9174940 Publication Date 11/3/2015 
Target
Name:
Thyrotropin receptor
Synonyms:
LGR3 TSHR Thyroid stimulating hormone receptor Thyroid-stimulating hormone receptor (TSH) | Thyrotropin receptor
Type:
Enzyme
Mol. Mass.:
86834.44
Organism:
Homo sapiens (Human)
Description:
P16473
Residue:
764
  
Inhibitor
Name:
BDBM60850
Synonyms:
US9174940, 13
Type:
Emp. Form.:
C28H30ClN3O2
Mol. Mass.:
476.01
SMILES:
CC(=O)N1c2ccc(NC(=O)NCc3ccc(Cl)cc3)cc2C(C)(CC1(C)C)c1ccccc1
: