Target
Glucose-dependent insulinotropic receptor [1-198]/[199-335]
Ligand
BDBM189334
Substrate
Meas. Tech.
Tet-Inducible cAMP Assay
EC50
2±n/a nM
Citation
 Broekema, MWu, GWacker, DA Pyrimidinylpiperidinyloxypyridone analogues as GPR119 modulators US Patent  US9174965 Publication Date 11/3/2015 
Target
Name:
Glucose-dependent insulinotropic receptor [1-198]/[199-335]
Synonyms:
Human-mouse GPR119
Type:
Protein
Mol. Mass.:
Description:
Components:
This complex has 2 components.
Component 1
Name:
Glucose-dependent insulinotropic receptor [1-198]
Synonyms:
GP119_HUMAN Glucose-dependent insulinotropic receptor (GPR119)
Type:
Enzyme
Mol. Mass.:
21505.57
Organism:
Homo sapiens (Human)
Description:
Q8TDV5: The first 198 amino acids of human GPR119
Residue:
198
  
Component 2
Name:
Glucose-dependent insulinotropic receptor [199-335]
Synonyms:
GP119_MOUSE Gpr119
Type:
Enzyme
Mol. Mass.:
15641.79
Organism:
Mus musculus (Mouse)
Description:
Q7TQP3: C-terminal 137 amino acids of the mouse receptor GPR119
Residue:
137
  
Inhibitor
Name:
BDBM189334
Synonyms:
US9174965, 1
Type:
Small organic molecule
Emp. Form.:
C24H24Cl2N6O4
Mol. Mass.:
531.391
SMILES:
Cc1nc(ccc1N1CCC(O)C1=O)-n1cc(Cl)c(OC2CCN(CC2)c2ncc(Cl)cn2)cc1=O
: