Target
Cyclin-dependent kinase 1/G2/mitotic-specific cyclin-B
Ligand
BDBM5533
Substrate
Histone H1
Meas. Tech.
Kinase Inhibition Assay
IC50
5300±n/a nM
Citation
 Hardcastle, IRArris, CEBentley, JBoyle, FTChen, YCurtin, NJEndicott, JAGibson, AEGolding, BTGriffin, RJJewsbury, PMenyerol, JMesguiche, VNewell, DRNoble, MEPratt, DJWang, LZWhitfield, HJ N2-substituted O6-cyclohexylmethylguanine derivatives: potent inhibitors of cyclin-dependent kinases 1 and 2. J Med Chem 47:3710-22 (2004)  
Target
Name:
Cyclin-dependent kinase 1/G2/mitotic-specific cyclin-B
Synonyms:
CDK1/Cyclin B p34cdc2/Cyclin B
Type:
Protein Complex
Mol. Mass.:
Description:
p34cdc2/cyclin B was purified from M-phase starfish oocytes by affinity chromatography.
Components:
This complex has 2 components.
Component 1
Name:
Cyclin-dependent kinase 1
Synonyms:
CDK1_ORYLA P34 protein kinase cdk1
Type:
Enzyme Subunit
Mol. Mass.:
34693.35
Organism:
Marthasterias glacialis (starfish)
Description:
Q9DGD3 {empty hard to find)
Residue:
303
  
Component 2
Name:
G2/mitotic-specific cyclin-B
Synonyms:
CCNB_MARGL G2/mitotic-specific cyclin-B1
Type:
Enzyme Subunit
Mol. Mass.:
43790.28
Organism:
Marthasterias glacialis (starfish)
Description:
Residue:
388
  
Inhibitor
Name:
BDBM5533
Synonyms:
2-(3 -Bromoanilino)-6-cyclohexylmethoxypurine O6-Cyclohexylmethylguanine deriv. 17
Type:
Small organic molecule
Emp. Form.:
C18H20BrN5O
Mol. Mass.:
402.288
SMILES:
Brc1cccc(Nc2nc(OCC3CCCCC3)c3[nH]cnc3n2)c1
:
Substrate
Name:
Histone H1
Synonyms:
Sigma Type IIIS
Type:
Other Protein Type
Mol. Mass.:
358.43
Organism:
Bos taurus (bovine)
Description:
12.5 uM ATP as co-substrate.
Residue:
3
NA