Target
Aurora kinase B
Ligand
BDBM189379
Substrate
Meas. Tech.
Isothermal Titration Calorimetry (ITC)
pH
8±0
Temperature
298.15±0 K
Kd
1.14e+3± 6e+1 nM
Citation
 Karthigeyan, DSurabhi, SMizar, PSoumik, SBanerjee, ASinha, SHDasgupta, DNarayana, CKundu, TK A Dual Non-ATP Analogue Inhibitor of Aurora Kinases A and B, Derived from Resorcinol with a Mixed Mode of Inhibition. Chem Biol Drug Des 87:958-67 (2016)  
Target
Name:
Aurora kinase B
Synonyms:
AIK2 AIM1 ARK2 AURKB_HUMAN Aurora B-INCENP Aurora kinase B (AURKB) STK-1 STK12 Serine/threonine-protein kinase aurora B
Type:
Protein
Mol. Mass.:
39327.72
Organism:
Homo sapiens (Human)
Description:
Q96GD4
Residue:
344
  
Inhibitor
Name:
BDBM189379
Synonyms:
5-O-ethyl 3-O-methyl 4-(2,3-dichlorophenyl)-2,6-dimethyl-1,4-dihydropyridine-3,5-dicarboxylate | Felodipine
Type:
Small organic molecule
Emp. Form.:
C18H19Cl2NO4
Mol. Mass.:
384.254
SMILES:
CCOC(=O)C1=C(C)NC(C)=C(C1c1cccc(Cl)c1Cl)C(=O)OC
: