Target
Coagulation factor VII
Ligand
BDBM189441
Substrate
Meas. Tech.
In Vitro Assay
Ki
0.23±n/a nM
Citation
 Zhang, XGlunz, PPriestley, ESJohnson, JAWurtz, NRLadziata, V Macrocyclic factor VIIa inhibitors US Patent  US9174974 Publication Date 11/3/2015 
Target
Name:
Coagulation factor VII
Synonyms:
Eptacog alfa FA7_HUMAN Factor VIIa (fVIIa) SPCA serum prothrombin conversion accelerator
Type:
Enzyme
Mol. Mass.:
51599.89
Organism:
Homo sapiens (Human)
Description:
Residue:
466
  
Inhibitor
Name:
BDBM189441
Synonyms:
US9174974, Example 26
Type:
Small organic molecule
Emp. Form.:
C33H34FN5O5S
Mol. Mass.:
631.717
SMILES:
C[C@H]1COC(=O)Nc2ccc(c(CN(C)C(=O)[C@H](Nc3cc4ccnc(N)c4cc3F)c3ccc1c(C)c3)c2)S(=O)(=O)C1CC1
: