Target
Coagulation factor VII
Ligand
BDBM189448
Substrate
Meas. Tech.
In Vitro Assay
Ki
0.14±n/a nM
Citation
 Zhang, XGlunz, PPriestley, ESJohnson, JAWurtz, NRLadziata, V Macrocyclic factor VIIa inhibitors US Patent  US9174974 Publication Date 11/3/2015 
Target
Name:
Coagulation factor VII
Synonyms:
Eptacog alfa FA7_HUMAN Factor VIIa (fVIIa) SPCA serum prothrombin conversion accelerator
Type:
Enzyme
Mol. Mass.:
51599.89
Organism:
Homo sapiens (Human)
Description:
Residue:
466
  
Inhibitor
Name:
BDBM189448
Synonyms:
US9174974, Example 34
Type:
Small organic molecule
Emp. Form.:
C33H35F2N5O5S
Mol. Mass.:
651.723
SMILES:
CC(C)S(=O)(=O)c1c(F)cc2NC(=O)OC[C@H](C)c3ccc(cc3C)[C@@H](Nc3cc4ccnc(N)c4cc3F)C(=O)N(C)Cc1c2
: