Target
Apoptosis regulator Bcl-2
Ligand
BDBM189464
Substrate
Meas. Tech.
Time Resolved-Fluorescence Resonance Energy Transfer (TR-FRET) Assay
Temperature
298.15±n/a K
Ki
<0.01±n/a nM
Comments
extracted
Citation
 Bruncko, MDing, HDoherty, GAElmore, SWHasvold, LAHexamer, LKunzer, ARSong, XSouers, AJSullivan, GMTao, ZWang, GTWang, LWang, XWendt, MDMantei, RAHansen, TM Apoptosis-inducing agents for the treatment of cancer and immune and autoimmune diseases US Patent  US9174982 Publication Date 11/3/2015 
Target
Name:
Apoptosis regulator Bcl-2
Synonyms:
Apoptosis regulator Bcl-2 Protein BCL-2 BCL2_HUMAN | Bcl-2 Protein
Type:
Homodimer or heterodimer
Mol. Mass.:
26269.11
Organism:
Homo sapiens (Human)
Description:
P10415
Residue:
239
  
Inhibitor
Name:
BDBM189464
Synonyms:
US10213433, Compound 10 US9174982, 10
Type:
Small organic molecule
Emp. Form.:
C42H46ClN7O7S
Mol. Mass.:
828.375
SMILES:
COCCNc1ccc(cc1[N+]([O-])=O)S(=O)(=O)NC(=O)c1ccc(cc1Oc1cnc2[nH]ccc2c1)N1CCN(CC2=C(CC(C)(C)CC2)c2ccc(Cl)cc2)CC1
: