Target
Neutrophil elastase
Ligand
BDBM189849
Substrate
Meas. Tech.
Inhibition Assay
pH
7.4±n/a
Temperature
310.15±n/a K
IC50
0.9±n/a nM
Comments
extracted
Citation
 Von Nussbaum, FKarthaus, DAnlauf, SDelbeck, MLi, VMMeibom, DLustig, KSchamberger, J 4-(4-cyano-2-thioaryl)dihydropyrimidinones and use thereof US Patent  US9174997 Publication Date 11/3/2015 
Target
Name:
Neutrophil elastase
Synonyms:
Bone marrow serine protease Coagulation factor X ELANE Elastase HLE Leukocyte elastase Medullasin Neutrophil elastase (HNE) PMN elastase Trypsin
Type:
Enzyme
Mol. Mass.:
28532.38
Organism:
Homo sapiens (Human)
Description:
P08246
Residue:
267
  
Inhibitor
Name:
BDBM189849
Synonyms:
US9174997, 69
Type:
Small organic molecule
Emp. Form.:
C31H26F3N7O4S
Mol. Mass.:
649.643
SMILES:
CC1=C([N+]#[C-])[C@H](N(C(=O)N2CCN(CC2)c2ccccn2)C(=O)N1c1cccc(c1)C(F)(F)F)c1ccc(cc1S(C)(=O)=O)C#N
: