Target
Histone-lysine N-methyltransferase EZH2 [A677G]
Ligand
BDBM190182
Substrate
Meas. Tech.
Inhibition Assay
IC50
19±n/a nM
Citation
 Kuntz, KWKnutson, SKWigle, TJ Inhibitors of human EZH2, and methods of use thereof US Patent  US9175331 Publication Date 11/3/2015 
Target
Name:
Histone-lysine N-methyltransferase EZH2 [A677G]
Synonyms:
EZH2 Histone-lysine N-methyltransferase EZH2 (A677G) | KMT6
Type:
Protein
Mol. Mass.:
85381.87
Organism:
Homo sapiens (Human)
Description:
Q15910[A677G]
Residue:
746
  
Inhibitor
Name:
BDBM190182
Synonyms:
EPZ006089 | US9175331, 8
Type:
Small organic molecule
Emp. Form.:
C31H44N4O2
Mol. Mass.:
504.7067
SMILES:
CN(C1CCCC1)c1cc(cc(C(=O)NCc2c(C)cc(C)[nH]c2=O)c1C)C1=CC(C)(C)NC(C)(C)C1
: