Target
Histone-lysine N-methyltransferase EZH2 [A677G]
Ligand
BDBM190197
Substrate
Meas. Tech.
Inhibition Assay
IC50
9.3±n/a nM
Citation
 Kuntz, KWKnutson, SKWigle, TJ Inhibitors of human EZH2, and methods of use thereof US Patent  US9175331 Publication Date 11/3/2015 
Target
Name:
Histone-lysine N-methyltransferase EZH2 [A677G]
Synonyms:
EZH2 Histone-lysine N-methyltransferase EZH2 (A677G) | KMT6
Type:
Protein
Mol. Mass.:
85381.87
Organism:
Homo sapiens (Human)
Description:
Q15910[A677G]
Residue:
746
  
Inhibitor
Name:
BDBM190197
Synonyms:
EPZ008278 | US9175331, 26
Type:
Small organic molecule
Emp. Form.:
C30H36N6O2
Mol. Mass.:
512.6458
SMILES:
CC(C)n1cc(C)c2c(cc(cc12)-c1ccc(nc1)N1CCNCC1)C(=O)NCc1c(C)cc(C)[nH]c1=O
: