Target
Histone-lysine N-methyltransferase EZH2 [A677G]
Ligand
BDBM190199
Substrate
Meas. Tech.
Inhibition Assay
IC50
1.5±n/a nM
Citation
 Kuntz, KWKnutson, SKWigle, TJ Inhibitors of human EZH2, and methods of use thereof US Patent  US9175331 Publication Date 11/3/2015 
Target
Name:
Histone-lysine N-methyltransferase EZH2 [A677G]
Synonyms:
EZH2 Histone-lysine N-methyltransferase EZH2 (A677G) | KMT6
Type:
Protein
Mol. Mass.:
85381.87
Organism:
Homo sapiens (Human)
Description:
Q15910[A677G]
Residue:
746
  
Inhibitor
Name:
BDBM190199
Synonyms:
EPZ008286 | US9175331, 29
Type:
Small organic molecule
Emp. Form.:
C31H42N4O2
Mol. Mass.:
502.6908
SMILES:
CCN([C@H]1CC[C@@H](CC1)N(C)C)c1cc(cc(C(=O)NCc2c(C)cc(C)[nH]c2=O)c1C)C#CC1CC1
: